clear query| facets| time Search criteria: .   Results from 1 to 6 from 6 (0.0s).
Loading phrases to help you
refine your search...
[HADOOP-15475] Fix broken unit tests on Windows - Hadoop - [issue]
...There are hundreds of unit tests that fail on Windows. This JIRA tracks the effort to fix them.The main reasons for unit test failures on Windows are: Windows/Linux path formats (e.g., HDFS-...
http://issues.apache.org/jira/browse/HADOOP-15475    Author: Anbang Hu , 2018-08-12, 14:54
[HADOOP-15496] TestFsShellList#testList fails on Windows - Hadoop - [issue]
...TestFsShellList#testList fails on Windows because Windows filename does not accept "\", while in the testcreateFile(new Path(testRootDir, "abc\bd\tef"));...createFile(new Path(testRootDir, "...
http://issues.apache.org/jira/browse/HADOOP-15496    Author: Anbang Hu , 2018-06-05, 15:22
[HADOOP-15497] TestTrash should use proper test path to avoid failing on Windows - Hadoop - [issue]
...The following fail on Windows due to improper path: TestHDFSTrash#testNonDefaultFS TestTrash...
http://issues.apache.org/jira/browse/HADOOP-15497    Author: Anbang Hu , 2018-06-03, 23:27
[HADOOP-15498] TestHadoopArchiveLogs (#testGenerateScript, #testPrepareWorkingDir) fails on Windows - Hadoop - [issue]
...TestHadoopArchiveLogs#testGenerateScript fails on Windows because script generation uses "\n", but description uses System.lineSeparator().TestHadoopArchiveLogs#testPrepareWorkingDir fails o...
http://issues.apache.org/jira/browse/HADOOP-15498    Author: Anbang Hu , 2018-05-29, 00:21
[HADOOP-15467] TestDoAsEffectiveUser#testRealUserSetup,TestDoAsEffectiveUser#testRealUserAuthorizationSuccess time out on Windows - Hadoop - [issue]
...[INFO] Running org.apache.hadoop.security.TestDoAsEffectiveUser[ERROR] Tests run: 2, Failures: 0, Errors: 2, Skipped: 0, Time elapsed: 8.307 s <<< FAILURE! - in org....
http://issues.apache.org/jira/browse/HADOOP-15467    Author: Anbang Hu , 2018-05-26, 22:25
[HADOOP-15494] TestRawLocalFileSystemContract fails on Windows - Hadoop - [issue]
...hadoop-trunk-win #476 TestRawLocalFileSystemContract shows following similar errors for 21 tests:java.net.URISyntaxException: Relative path in absolute URI: file://target/test/data/testMulti...
http://issues.apache.org/jira/browse/HADOOP-15494    Author: Anbang Hu , 2018-05-25, 10:35