I know it has been a little while since I brought this up...I pulled down
the 3.7.1-RELEASE branch from GitHub in order to test out the change to
Kryo v. 4.0.2 and encountered no problems while building, however, when I
try to do mvn install, there are several failed tests.  I am hoping, that
other than the obvious (to me, anyway) errors such as not finding
yarn-site.xml on my laptop which does not have hadoop installed, someone
may be able to see what is going on?

-------------------------------------------------------------------------------
Test set: com.datatorrent.stram.StramRecoveryTest
-------------------------------------------------------------------------------
Tests run: 8, Failures: 1, Errors: 0, Skipped: 0, Time elapsed: 6.372 sec
<<< FAILURE! - in com.datatorrent.stram.StramRecoveryTest
testWriteAheadLog(com.datatorrent.stram.StramRecoveryTest)  Time elapsed:
0.115 sec  <<< FAILURE!
java.lang.AssertionError: flush count expected:<1> but was:<2>
at
com.datatorrent.stram.StramRecoveryTest.testWriteAheadLog(StramRecoveryTest.java:326)
-------------------------------------------------------------------------------
Test set: com.datatorrent.stram.engine.StatsTest
-------------------------------------------------------------------------------
Tests run: 6, Failures: 1, Errors: 0, Skipped: 0, Time elapsed: 21.894 sec
<<< FAILURE! - in com.datatorrent.stram.engine.StatsTest
testQueueSizeForContainerLocalOperators(com.datatorrent.stram.engine.StatsTest)
 Time elapsed: 3.266 sec  <<< FAILURE!
java.lang.AssertionError: Validate input port queue size -1
at
com.datatorrent.stram.engine.StatsTest.baseTestForQueueSize(StatsTest.java:270)
at
com.datatorrent.stram.engine.StatsTest.testQueueSizeForContainerLocalOperators(StatsTest.java:285)

-------------------------------------------------------------------------------
Test set: com.datatorrent.stram.StramMiniClusterTest
-------------------------------------------------------------------------------
Tests run: 1, Failures: 0, Errors: 1, Skipped: 0, Time elapsed: 0.002 sec
<<< FAILURE! - in com.datatorrent.stram.StramMiniClusterTest
com.datatorrent.stram.StramMiniClusterTest  Time elapsed: 0.002 sec  <<<
ERROR!
java.io.FileNotFoundException:
/Users/mbossert/Library/Mobile%20Documents/com~apple~CloudDocs/Punch/IdeaProjects/apex-core/engine/target/test-classes/yarn-site.xml
(No such file or directory)
at
com.datatorrent.stram.StramMiniClusterTest.setup(StramMiniClusterTest.java:151)

-------------------------------------------------------------------------------
Test set: com.datatorrent.stram.StramLocalClusterTest
-------------------------------------------------------------------------------
Tests run: 4, Failures: 2, Errors: 0, Skipped: 0, Time elapsed: 15.081 sec
<<< FAILURE! - in com.datatorrent.stram.StramLocalClusterTest
testAppPath(com.datatorrent.stram.StramLocalClusterTest)  Time elapsed:
0.138 sec  <<< FAILURE!
java.lang.AssertionError: checkpoint path exists
at
com.datatorrent.stram.StramLocalClusterTest.testAppPath(StramLocalClusterTest.java:413)

testLocalClusterInitShutdown(com.datatorrent.stram.StramLocalClusterTest)
 Time elapsed: 5.191 sec  <<< FAILURE!
java.lang.AssertionError:
./target/com.datatorrent.stram.StramLocalClusterTest-testLocalClusterInitShutdown.out
exists
at
com.datatorrent.stram.StramLocalClusterTest.testLocalClusterInitShutdown(StramLocalClusterTest.java:117)

-------------------------------------------------------------------------------
Test set: com.datatorrent.stram.client.AppPackageTest
-------------------------------------------------------------------------------
Tests run: 4, Failures: 2, Errors: 0, Skipped: 0, Time elapsed: 0.105 sec
<<< FAILURE! - in com.datatorrent.stram.client.AppPackageTest
testAppPackage(com.datatorrent.stram.client.AppPackageTest)  Time elapsed:
0 sec  <<< FAILURE!
java.lang.AssertionError: Number of applications expected:<2> but was:<0>
at
com.datatorrent.stram.client.AppPackageTest.testAppPackage(AppPackageTest.java:91)

testAppLevelRequiredAndDefaultProperties(com.datatorrent.stram.client.AppPackageTest)
 Time elapsed: 0.001 sec  <<< FAILURE!
java.lang.AssertionError: Should consist of an app called MyFirstApplication
at
com.datatorrent.stram.client.AppPackageTest.testAppLevelRequiredAndDefaultProperties(AppPackageTest.java:171)
Test set: com.datatorrent.stram.cli.ApexCliTest
Tests run: 7, Failures: 2, Errors: 2, Skipped: 0, Time elapsed: 0.938 sec
<<< FAILURE! - in com.datatorrent.stram.cli.ApexCliTest
testAppFromOnlyConfigPackage(com.datatorrent.stram.cli.ApexCliTest)  Time
elapsed: 0.104 sec  <<< ERROR!
com.datatorrent.stram.cli.ApexCli$CliException: No applications in
Application Package
at
com.datatorrent.stram.cli.ApexCliTest.testAppFromOnlyConfigPackage(ApexCliTest.java:235)

testLaunchAppPackagePropertyPrecedence(com.datatorrent.stram.cli.ApexCliTest)
 Time elapsed: 0.045 sec  <<< FAILURE!
org.junit.ComparisonFailure: expected:<[app]-default> but
was:<[package]-default>
at
com.datatorrent.stram.cli.ApexCliTest.testLaunchAppPackagePropertyPrecedence(ApexCliTest.java:143)

testLaunchAppPackageParametersWithConfigPackage(com.datatorrent.stram.cli.ApexCliTest)
 Time elapsed: 0.045 sec  <<< ERROR!
com.datatorrent.stram.cli.ApexCli$CliException: No applications in
Application Package matching "MyFirstApplication"
at
com.datatorrent.stram.cli.ApexCliTest.testLaunchAppPackageParametersWithConfigPackage(ApexCliTest.java:155)

testLaunchAppPackagePrecedenceWithConfigPackage(com.datatorrent.stram.cli.ApexCliTest)
 Time elapsed: 0.058 sec  <<< FAILURE!
org.junit.ComparisonFailure: expected:<[app]-default> but
was:<[package]-default>
at
com.datatorrent.stram.cli.ApexCliTest.testLaunchAppPackagePrecedenceWithConfigPackage(ApexCliTest.java:204)
On Thu, May 17, 2018 at 1:31 PM, Aaron Bossert <[EMAIL PROTECTED]> wrote:
M. Aaron Bossert
(571) 242-4021
Punch Cyber Analytics Group