clear query| facets| time Search criteria: .   Results from 1 to 10 from 13 (0.0s).
Loading phrases to help you
refine your search...
[OOZIE-3349] Test cases in oozie fail with java.net.ConnectException - Oozie - [issue]
...Maven command used : mvn test -fnError :java.net.ConnectException: Connection refused; For more details see:  http://wiki.apache.org/hadoop/ConnectionRefused at sun.reflect.GeneratedCon...
http://issues.apache.org/jira/browse/OOZIE-3349    Author: Alisha Prabhu , 2018-09-20, 04:06
[CALCITE-2546] testProfileScott2 in ProfilerTest.java fail with java.lang.AssertionError - Calcite - [issue]
...Maven command used in the core module : mvn -Dtest=ProfilerTest#testProfileScott2 testThe values expectedCardinality and surprise for columns:[HIREDATE,COMM] in the test case differ ...
http://issues.apache.org/jira/browse/CALCITE-2546    Author: Alisha Prabhu , 2018-09-17, 18:17
[AMBARI-24400] Tests in ambari-metrics fail with java.lang.NoSuchFieldError: mapper - Ambari - [issue]
...Commands used at ./ambari/ambari-metrics/ : mvn -Dtest=AggregatedMetricsPublisherTest -DfailIfNoTests=false testmvn -Dtest=RawMetricsPublisherTest -DfailIfNoTests=false testError :Tests run:...
http://issues.apache.org/jira/browse/AMBARI-24400    Author: Alisha Prabhu , 2018-08-28, 11:50
Facing an issue with the ReplDumpTaskTest.java in Hive Query Language. - Hive - [mail # dev]
...[INFO] Running org.apache.hadoop.hive.ql.exec.repl.ReplDumpTaskTest[ERROR] Tests run: 1, Failures: 0, Errors: 1, Skipped: 0, Time elapsed: 5.536 s <<< FAILURE! - in org.apache.hadoo...
   Author: Alisha Prabhu , 2018-08-09, 06:10
[HIVE-19454] Test failure : org.apache.hadoop.hive.ql.TestTxnCommands2.testNonAcidToAcidConversion1 fails with java.lang.AssertionError - Hive - [issue]
...org.apache.hadoop.hive.ql.TestTxnCommands2WithSplitUpdateAndVectorization.testNonAcidToAcidConversion1 refers to the same test case.Maven command used is : mvn -Dtest=TestTxnCommands2 testEr...
http://issues.apache.org/jira/browse/HIVE-19454    Author: Alisha Prabhu , 2018-07-31, 01:33
[HIVE-19780] Test failure : org.apache.hadoop.hive.ql.TestTxnNoBuckets fails with java.lang.AssertionError - Hive - [issue]
...Maven command used is mvn -Dtest=TestTxnNoBuckets#testCTAS testError:[INFO] Running org.apache.hadoop.hive.ql.TestTxnNoBuckets[ERROR] Tests run: 1, Failures: 1, Errors: 0, Skipped: 0, Time e...
http://issues.apache.org/jira/browse/HIVE-19780    Author: Alisha Prabhu , 2018-06-25, 09:56
[HIVE-19084] Test case in Hive Query Language fails with a java.lang.AssertionError. - Hive - [issue]
...The test case testInsertOverwriteForPartitionedMmTable in TestTxnCommandsForMmTable.java and TestTxnCommandsForOrcMmTable.java fails with a java.lang.AssertionError on ppc arch.Maven command...
http://issues.apache.org/jira/browse/HIVE-19084    Author: Alisha Prabhu , 2018-06-01, 18:01
[OOZIE-3226] [tools] TestOozieDBCLI#testOozieDBCLI() fails - Oozie - [issue]
...Maven command used is : mvn -Dtest=TestOozieDBCLI testThe test case testOozieDBCLI() in oozie-tools fails in the presence of the test case testServicesDestroy()[INFO] Running org.apache.oozi...
http://issues.apache.org/jira/browse/OOZIE-3226    Author: Alisha Prabhu , 2018-05-16, 20:17
[OOZIE-3230] TestPigActionExecutor in oozie-sharelib fail with junit.framework.AssertionFailedError - Oozie - [issue]
...Maven command used is :  mvn -Dtest=TestPigActionExecutor test[ERROR] Failures:[ERROR] TestPigActionExecutor.testExecutionStats:190->XTestCase.waitUntilYarnAppDoneAndAssertSuccess:1333 YA...
http://issues.apache.org/jira/browse/OOZIE-3230    Author: Alisha Prabhu , 2018-05-15, 04:40
[OOZIE-3176] Oozie-core fails with checkstyle errors - Oozie - [issue]
...There are multiple checkstyle violations in the Oozie-core module.Maven command used is mvn clean install -DskipTestsI have attached the Checkstyle-errors.txt file, that has the errors occur...
http://issues.apache.org/jira/browse/OOZIE-3176    Author: Alisha Prabhu , 2018-04-09, 15:15